Target
DNA dC->dU-editing enzyme APOBEC-3G
Ligand
BDBM46667
Substrate
Meas. Tech.
Dose Response confirmation of small molecule APOBEC3G DNA Deaminase Inhibitors via a fluorescence-based single-stranded DNA deaminase assay
Temperature
298.15±n/a K
IC50
6400±n/a nM
Comments
extracted
Citation
 PubChem, PC Dose Response confirmation of small molecule APOBEC3G DNA Deaminase Inhibitors via a fluorescence-based single-stranded DNA deaminase assay PubChem Bioassay (2011)[AID] 
Target
Name:
DNA dC->dU-editing enzyme APOBEC-3G
Synonyms:
ABC3G_HUMAN | APOBEC3G
Type:
Enzyme Catalytic Domain
Mol. Mass.:
46419.54
Organism:
Homo sapiens (Human)
Description:
gi_13399304
Residue:
384
  
Inhibitor
Name:
BDBM46667
Synonyms:
2-phenyl-1,2-benzothiazol-3-one MLS-0107957.0001 cid_164981
Type:
Small organic molecule
Emp. Form.:
C13H9NOS
Mol. Mass.:
227.282
SMILES:
O=c1n(sc2ccccc12)-c1ccccc1
: