Target
Cysteine protease ATG4B
Ligand
BDBM48038
Substrate
Meas. Tech.
Dose response confirmation of the uHTS fluorescent assay for identification of inhibitors of ATG4B.
IC50
5850±n/a nM
Citation
 PubChem, PC Dose response confirmation of the uHTS fluorescent assay for identification of inhibitors of ATG4B. PubChem Bioassay (2011)[AID] 
Target
Name:
Cysteine protease ATG4B
Synonyms:
APG4B ATG4B_HUMAN KIAA0943 hck
Type:
Enzyme Catalytic Domain
Mol. Mass.:
44279.79
Organism:
Homo sapiens (Human)
Description:
gi_47132611
Residue:
393
  
Inhibitor
Name:
BDBM48038
Synonyms:
4-[(E)-[3-(2-methylanilino)-4-oxo-1-naphthalenylidene]amino]sulfonylbenzoic acid 4-[(E)-[3-[(2-methylphenyl)amino]-4-oxidanylidene-naphthalen-1-ylidene]amino]sulfonylbenzoic acid MLS000948152 cid_6023693
Type:
Small organic molecule
Emp. Form.:
C24H18N2O5S
Mol. Mass.:
446.475
SMILES:
Cc1ccccc1NC1=CC(=NS(=O)(=O)c2ccc(cc2)C(O)=O)c2ccccc2C1=O
: