Target
Hexokinase-1
Ligand
BDBM80793
Substrate
Meas. Tech.
Dose Response confirmation of activators of hexokinase domain containing I (HKDC1) in the hexokinase 1 selectivity assay
EC50
32000±n/a nM
Citation
 PubChem, PC Dose Response confirmation of activators of hexokinase domain containing I (HKDC1) in the hexokinase 1 selectivity assay PubChem Bioassay (2011)[AID] 
Target
Name:
Hexokinase-1
Synonyms:
Brain form hexokinase HK1 Hexokinase type I hexokinase-1 isoform HKI
Type:
PROTEIN
Mol. Mass.:
102488.34
Organism:
Homo sapiens (Human)
Description:
EBI_11382
Residue:
917
  
Inhibitor
Name:
BDBM80793
Synonyms:
3-(1-methyl-2-phenyl-3-indolyl)-3-oxopropanenitrile 3-(1-methyl-2-phenylindol-3-yl)-3-oxopropanenitrile MLS001005254 cid_2404762
Type:
Small organic molecule
Emp. Form.:
C18H14N2O
Mol. Mass.:
274.3166
SMILES:
Cn1c(c(C(=O)CC#N)c2ccccc12)-c1ccccc1
: