Target
Hexokinase-1
Ligand
BDBM80796
Substrate
Meas. Tech.
Dose Response confirmation of activators of hexokinase domain containing I (HKDC1) in the hexokinase 1 selectivity assay
EC50
17800±n/a nM
Citation
 PubChem, PC Dose Response confirmation of activators of hexokinase domain containing I (HKDC1) in the hexokinase 1 selectivity assay PubChem Bioassay (2011)[AID] 
Target
Name:
Hexokinase-1
Synonyms:
Brain form hexokinase HK1 Hexokinase type I hexokinase-1 isoform HKI
Type:
PROTEIN
Mol. Mass.:
102488.34
Organism:
Homo sapiens (Human)
Description:
EBI_11382
Residue:
917
  
Inhibitor
Name:
BDBM80796
Synonyms:
(4-fluorophenyl)-[5-(p-tolyl)-6H-1,3,4-thiadiazin-2-yl]amine N-(4-fluorophenyl)-5-(4-methylphenyl)-6H-1,3,4-thiadiazin-2-amine cid_5026871
Type:
Small organic molecule
Emp. Form.:
C16H14FN3S
Mol. Mass.:
299.366
SMILES:
Cc1ccc(cc1)C1=NN=C(Nc2ccc(F)cc2)SC1
: