Target
Hexokinase-1
Ligand
BDBM50673
Substrate
Meas. Tech.
Dose Response confirmation of activators of hexokinase domain containing I (HKDC1) in the hexokinase 1 selectivity assay
EC50
7650±n/a nM
Citation
 PubChem, PC Dose Response confirmation of activators of hexokinase domain containing I (HKDC1) in the hexokinase 1 selectivity assay PubChem Bioassay (2011)[AID] 
Target
Name:
Hexokinase-1
Synonyms:
Brain form hexokinase HK1 Hexokinase type I hexokinase-1 isoform HKI
Type:
PROTEIN
Mol. Mass.:
102488.34
Organism:
Homo sapiens (Human)
Description:
EBI_11382
Residue:
917
  
Inhibitor
Name:
BDBM50673
Synonyms:
MLS001002736 N-[4-[2-(4-morpholinosulfonylanilino)-6H-1,3,4-thiadiazin-5-yl]phenyl]acetamide N-[4-[2-[4-(4-morpholinylsulfonyl)anilino]-6H-1,3,4-thiadiazin-5-yl]phenyl]acetamide cid_4834997
Type:
Small organic molecule
Emp. Form.:
C21H23N5O4S2
Mol. Mass.:
473.568
SMILES:
CC(=O)Nc1ccc(cc1)C1=NN=C(Nc2ccc(cc2)S(=O)(=O)N2CCOCC2)SC1
: