Target
Hexokinase-1
Ligand
BDBM45724
Substrate
Meas. Tech.
Dose Response confirmation of activators of hexokinase domain containing I (HKDC1) in the hexokinase 1 selectivity assay
EC50
10600±n/a nM
Citation
 PubChem, PC Dose Response confirmation of activators of hexokinase domain containing I (HKDC1) in the hexokinase 1 selectivity assay PubChem Bioassay (2011)[AID] 
Target
Name:
Hexokinase-1
Synonyms:
Brain form hexokinase HK1 Hexokinase type I hexokinase-1 isoform HKI
Type:
PROTEIN
Mol. Mass.:
102488.34
Organism:
Homo sapiens (Human)
Description:
EBI_11382
Residue:
917
  
Inhibitor
Name:
BDBM45724
Synonyms:
4-(3-Chloro-1,4-dioxo-1,4-dihydro-naphthalen-2-ylamino)-benzoic acid 4-[(3-chloro-1,4-dioxo-2-naphthalenyl)amino]benzoic acid 4-[[3-chloranyl-1,4-bis(oxidanylidene)naphthalen-2-yl]amino]benzoic acid SMR000414744 | cid_470952
Type:
Small organic molecule
Emp. Form.:
C17H10ClNO4
Mol. Mass.:
327.719
SMILES:
OC(=O)c1ccc(NC2=C(Cl)C(=O)c3ccccc3C2=O)cc1
: