Target
Lanosterol 14-alpha-demethylase
Ligand
BDBM81297
Substrate
Meas. Tech.
Inhibition Assay
pH
6±0
Kd
1.01e+3±n/a nM
Citation
 Lepesheva, GIOtt, RDHargrove, TYKleshchenko, YYSchuster, INes, WDHill, GCVillalta, FWaterman, MR Sterol 14alpha-demethylase as a potential target for antitrypanosomal therapy: enzyme inhibition and parasite cell growth. Chem Biol 14:1283-93 (2007)  
Target
Name:
Lanosterol 14-alpha-demethylase
Synonyms:
Lanosterol 14-alpha demethylase | Sterol 14-alpha demethylase (CYP51)
Type:
Protein
Mol. Mass.:
54377.77
Organism:
Trypanosoma brucei
Description:
Q385E8
Residue:
481
  
Inhibitor
Name:
BDBM81297
Synonyms:
Azole, 1
Type:
Small organic molecule
Emp. Form.:
C24H19Cl2N3O
Mol. Mass.:
436.333
SMILES:
Clc1ccc(cc1)C(CNC(=O)c1ccccc1)(c1ccc(Cl)cc1)n1ccnc1
: