Target
Lanosterol 14-alpha-demethylase
Ligand
BDBM81303
Substrate
Meas. Tech.
Inhibition Assay
pH
6±0
Kd
2.1e+2±n/a nM
Citation
 Lepesheva, GIOtt, RDHargrove, TYKleshchenko, YYSchuster, INes, WDHill, GCVillalta, FWaterman, MR Sterol 14alpha-demethylase as a potential target for antitrypanosomal therapy: enzyme inhibition and parasite cell growth. Chem Biol 14:1283-93 (2007)  
Target
Name:
Lanosterol 14-alpha-demethylase
Synonyms:
Lanosterol 14-alpha demethylase | Sterol 14-alpha demethylase (CYP51)
Type:
Protein
Mol. Mass.:
54377.77
Organism:
Trypanosoma brucei
Description:
Q385E8
Residue:
481
  
Inhibitor
Name:
BDBM81303
Synonyms:
Azole, 8
Type:
Small organic molecule
Emp. Form.:
C22H18ClN3OS
Mol. Mass.:
407.916
SMILES:
Clc1ccc(cc1)-c1cc(cs1)C(=O)NCC(c1ccccc1)n1ccnc1
: