Target
Cell division protein FtsZ
Ligand
BDBM81330
Substrate
Meas. Tech.
Fluorescent Competition Assay
pH
7.5±0
Kd
3.03±0.93 nM
Citation
 Läppchen, TPinas, VAHartog, AFKoomen, GJSchaffner-Barbero, CAndreu, JMTrambaiolo, DLöwe, JJuhem, APopov, AVden Blaauwen, T Probing FtsZ and tubulin with C8-substituted GTP analogs reveals differences in their nucleotide binding sites. Chem Biol 15:189-99 (2008)  
Target
Name:
Cell division protein FtsZ
Synonyms:
FTSZ_AQUAE | ftsZ
Type:
Protein
Mol. Mass.:
40146.54
Organism:
Aquifex aeolicus
Description:
O66809
Residue:
367
  
Inhibitor
Name:
BDBM81330
Synonyms:
+ 1 mM GTP | GTP
Type:
Small organic molecule
Emp. Form.:
C10H13N5O14P3
Mol. Mass.:
520.1583
SMILES:
Nc1nc2n(cnc2c(=O)[nH]1)[C@@H]1O[C@H](COP([O-])(=O)OP([O-])(=O)OP(O)([O-])=O)C(O)C1O
: