Target
Cell division protein FtsZ
Ligand
BDBM81333
Substrate
Meas. Tech.
Fluorescent Competition Assay
pH
7.5±0
IC50
3.5e+4±n/a nM
Kd
77±58 nM
Citation
 Läppchen, TPinas, VAHartog, AFKoomen, GJSchaffner-Barbero, CAndreu, JMTrambaiolo, DLöwe, JJuhem, APopov, AVden Blaauwen, T Probing FtsZ and tubulin with C8-substituted GTP analogs reveals differences in their nucleotide binding sites. Chem Biol 15:189-99 (2008)  
Target
Name:
Cell division protein FtsZ
Synonyms:
FTSZ_AQUAE | ftsZ
Type:
Protein
Mol. Mass.:
40146.54
Organism:
Aquifex aeolicus
Description:
O66809
Residue:
367
  
Inhibitor
Name:
BDBM81333
Synonyms:
ClGTP (4b)
Type:
Small organic molecule
Emp. Form.:
C10H12ClN5O14P3
Mol. Mass.:
554.603
SMILES:
Nc1nc2n([C@@H]3O[C@H](COP([O-])(=O)OP([O-])(=O)OP(O)([O-])=O)C(O)C3O)c(Cl)nc2c(=O)[nH]1
: