Target
Putative farnesyl pyrophosphate synthase
Ligand
BDBM12576
Substrate
Meas. Tech.
Enzymatic Assay
pH
7.7±0
Temperature
310.15±0 K
Ki
0.38±0.12 nM
IC50
45.7±2.6 nM
Citation
 Artz, JDDunford, JEArrowood, MJDong, AChruszcz, MKavanagh, KLMinor, WRussell, RGEbetino, FHOppermann, UHui, R Targeting a uniquely nonspecific prenyl synthase with bisphosphonates to combat cryptosporidiosis. Chem Biol 15:1296-306 (2008)  
Target
Name:
Putative farnesyl pyrophosphate synthase
Synonyms:
Type:
Enzyme
Mol. Mass.:
44960.82
Organism:
Cryptosporidium parvum
Description:
Belongs to the FPP/GGPP synthase family. Q5CR09
Residue:
384
  
Inhibitor
Name:
BDBM12576
Synonyms:
Bisphosphonate 1 JMC515594 Compound 64 Risdronate [1-hydroxy-1-phosphono-2-(pyridin-3-yl)ethyl]phosphonic acid
Type:
Small organic molecule
Emp. Form.:
C7H11NO7P2
Mol. Mass.:
283.1123
SMILES:
OC(Cc1cccnc1)(P(O)(O)=O)P(O)(O)=O
: