Target
Olfactory receptor
Ligand
BDBM50028837
Substrate
Meas. Tech.
Inhibition Assay
IC50
4.60e+5± 8.0e+4 nM
Citation
 Peterlin, ZLi, YSun, GShah, RFirestein, SRyan, K The importance of odorant conformation to the binding and activation of a representative olfactory receptor. Chem Biol 15:1317-27 (2008)  
Target
Name:
Olfactory receptor
Synonyms:
Olfactory receptor 17 | Olr17
Type:
Protein
Mol. Mass.:
35760.42
Organism:
Rattus norvegicus (Rat)
Description:
D3Z9H0
Residue:
346
  
Inhibitor
Name:
BDBM50028837
Synonyms:
Aldehydes, C5 PENTANAL
Type:
Small organic molecule
Emp. Form.:
C5H10O
Mol. Mass.:
86.1323
SMILES:
CCCCC=O
: