Target
Cyclin-dependent kinase 1
Ligand
BDBM81437
Substrate
Meas. Tech.
In Vitro Kinase Assay
Ki
>500±0 nM
Citation
 Wang, SGriffiths, GMidgley, CABarnett, ALCooper, MGrabarek, JIngram, LJackson, WKontopidis, GMcClue, SJMcInnes, CMcLachlan, JMeades, CMezna, MStuart, IThomas, MPZheleva, DILane, DPJackson, RCGlover, DMBlake, DGFischer, PM Discovery and characterization of 2-anilino-4- (thiazol-5-yl)pyrimidine transcriptional CDK inhibitors as anticancer agents. Chem Biol 17:1111-21 (2010)  
Target
Name:
Cyclin-dependent kinase 1
Synonyms:
CDC2 CDK1 CDKN1 Cell division protein kinase 1 P34CDC2 | p34 protein kinase
Type:
Enzyme Subunit
Mol. Mass.:
34101.08
Organism:
Homo sapiens (Human)
Description:
P06493
Residue:
297
  
Inhibitor
Name:
BDBM81437
Synonyms:
CDK Inhibitor, 10
Type:
Small organic molecule
Emp. Form.:
C19H22N6O3S2
Mol. Mass.:
446.546
SMILES:
Cc1nc(N)sc1-c1ccnc(Nc2ccc(C)c(c2)S(=O)(=O)N2CCOCC2)n1
: