Target
Beta-2 adrenergic receptor
Ligand
BDBM36024
Substrate
Ki
>10000±n/a nM
Comments
PDSP_1483
Citation
 Bylund, DBSnyder, SH Beta adrenergic receptor binding in membrane preparations from mammalian brain. Mol Pharmacol 12:568-80 (1976) Target
Name:
Beta-2 adrenergic receptor
Synonyms:
ADRB2 ADRB2_HUMAN Beta-2 adrenoceptor | Beta-2 adrenoreceptor
Type:
Mol. Mass.:
46461.69
Organism:
Homo sapiens (Human)
Description:
P07550
Residue:
413
  
Inhibitor
Name:
BDBM36024
Synonyms:
(R)-(-)-phenylephrine Phenylephrine,(-)
Type:
Guest
Emp. Form.:
C9H14NO2
Mol. Mass.:
168.2124
SMILES:
C[NH2+]C[C@H](O)c1cccc(O)c1
: