Target
Alpha-1A adrenergic receptor
Ligand
BDBM34652
Substrate
Ki
>70000±n/a nM
Comments
PDSP_20687
Citation
 U'Prichard, DCGreenberg, DASnyder, SH Binding characteristics of a radiolabeled agonist and antagonist at central nervous system alpha noradrenergic receptors. Mol Pharmacol 13:454-73 (1977) Target
Name:
Alpha-1A adrenergic receptor
Synonyms:
ADA1A_RAT Adra1c Alpha-1A adrenoceptor Alpha-1C adrenergic receptor | adrenergic Alpha1A
Type:
Protein
Mol. Mass.:
51620.15
Organism:
Rattus norvegicus (Rat)
Description:
P43140
Residue:
466
  
Inhibitor
Name:
BDBM34652
Synonyms:
(+)-ISOPROTERENOL (+)-BITARTRATE SALT 2,3-dihydroxybutanedioic acid;4-[(1S)-1-hydroxy-2-(propan-2-ylamino)ethyl]benzene-1,2-diol MLS000028736 cid_6852409
Type:
Small organic molecule
Emp. Form.:
C11H17NO3
Mol. Mass.:
211.2576
SMILES:
CC(C)NC[C@@H](O)c1ccc(O)c(O)c1
: