Target
Alpha-1A adrenergic receptor
Ligand
BDBM162128
Substrate
Ki
2600±n/a nM
Comments
PDSP_20592
Citation
 U'Prichard, DCGreenberg, DASnyder, SH Binding characteristics of a radiolabeled agonist and antagonist at central nervous system alpha noradrenergic receptors. Mol Pharmacol 13:454-73 (1977) Target
Name:
Alpha-1A adrenergic receptor
Synonyms:
ADA1A_RAT Adra1c Alpha-1A adrenoceptor Alpha-1C adrenergic receptor | adrenergic Alpha1A
Type:
Protein
Mol. Mass.:
51620.15
Organism:
Rattus norvegicus (Rat)
Description:
P43140
Residue:
466
  
Inhibitor
Name:
BDBM162128
Synonyms:
(S)-(+)-phenylephrine | Phenylephrine,(+)
Type:
Emp. Form.:
C9H13NO2
Mol. Mass.:
167.205
SMILES:
CNC[C@@H](O)c1cccc(O)c1
: