Target
UDP-N-acetylmuramoyl-tripeptide--D-alanyl-D-alanine ligase
Ligand
BDBM81629
Substrate
Meas. Tech.
Inhibition Assay
IC50
1.26e+4±n/a nM
Citation
 Stamper, GFLongenecker, KLFry, EHJakob, CGFlorjancic, ASGu, YGAnderson, DDCooper, CSZhang, TClark, RFCia, YBlack-Schaefer, CLOwen McCall, JLerner, CGHajduk, PJBeutel, BAStoll, VS Structure-based optimization of MurF inhibitors. Chem Biol Drug Des 67:58-65 (2006)  
Target
Name:
UDP-N-acetylmuramoyl-tripeptide--D-alanyl-D-alanine ligase
Synonyms:
MurF (S. pneumoniae) UDP-N-acetylmuramoylalanine-D-glutamyl-lysine-D-alanyl-D-alanine ligase
Type:
Protein
Mol. Mass.:
50482.72
Organism:
Streptococcus pneumoniae (Firmicutes)
Description:
S. pneumoniae MurF
Residue:
457
  
Inhibitor
Name:
BDBM81629
Synonyms:
MurF inhibitor, 13
Type:
Small organic molecule
Emp. Form.:
C16H15BrClN3O3S2
Mol. Mass.:
476.796
SMILES:
CCN(CC)S(=O)(=O)c1ccc(Cl)c(c1)C(=O)Nc1sc(Br)cc1C#N
: