Target
UDP-N-acetylmuramoyl-tripeptide--D-alanyl-D-alanine ligase
Ligand
BDBM50137786
Substrate
Meas. Tech.
Inhibition Assay
IC50
7e+1±n/a nM
Citation
 Stamper, GFLongenecker, KLFry, EHJakob, CGFlorjancic, ASGu, YGAnderson, DDCooper, CSZhang, TClark, RFCia, YBlack-Schaefer, CLOwen McCall, JLerner, CGHajduk, PJBeutel, BAStoll, VS Structure-based optimization of MurF inhibitors. Chem Biol Drug Des 67:58-65 (2006)  
Target
Name:
UDP-N-acetylmuramoyl-tripeptide--D-alanyl-D-alanine ligase
Synonyms:
MurF (S. pneumoniae) UDP-N-acetylmuramoylalanine-D-glutamyl-lysine-D-alanyl-D-alanine ligase
Type:
Protein
Mol. Mass.:
50482.72
Organism:
Streptococcus pneumoniae (Firmicutes)
Description:
S. pneumoniae MurF
Residue:
457
  
Inhibitor
Name:
BDBM50137786
Synonyms:
2,4-Dichloro-N-[3-cyano-6-(4-hydroxy-phenyl)-4,5,6,7-tetrahydro-benzo[b]thiophen-2-yl]-5-diethylsulfamoyl-benzamide MurF inhibitor, 15
Type:
Small organic molecule
Emp. Form.:
C26H25Cl2N3O4S2
Mol. Mass.:
578.53
SMILES:
CCN(CC)S(=O)(=O)c1cc(C(=O)Nc2sc3CC(CCc3c2C#N)c2ccc(O)cc2)c(Cl)cc1Cl
: