Target
UDP-N-acetylmuramoyl-tripeptide--D-alanyl-D-alanine ligase
Ligand
BDBM50137758
Substrate
Meas. Tech.
Inhibition Assay
IC50
22±n/a nM
Citation
 Stamper, GFLongenecker, KLFry, EHJakob, CGFlorjancic, ASGu, YGAnderson, DDCooper, CSZhang, TClark, RFCia, YBlack-Schaefer, CLOwen McCall, JLerner, CGHajduk, PJBeutel, BAStoll, VS Structure-based optimization of MurF inhibitors. Chem Biol Drug Des 67:58-65 (2006)  
Target
Name:
UDP-N-acetylmuramoyl-tripeptide--D-alanyl-D-alanine ligase
Synonyms:
MurF (S. pneumoniae) UDP-N-acetylmuramoylalanine-D-glutamyl-lysine-D-alanyl-D-alanine ligase
Type:
Protein
Mol. Mass.:
50482.72
Organism:
Streptococcus pneumoniae (Firmicutes)
Description:
S. pneumoniae MurF
Residue:
457
  
Inhibitor
Name:
BDBM50137758
Synonyms:
2,4-Dichloro-N-[3-cyano-6-(4-hydroxy-phenyl)-4,5,6,7-tetrahydro-benzo[b]thiophen-2-yl]-5-(morpholine-4-sulfonyl)-benzamide MurF inhibitor, 16
Type:
Small organic molecule
Emp. Form.:
C26H23Cl2N3O5S2
Mol. Mass.:
592.514
SMILES:
Oc1ccc(cc1)C1CCc2c(C1)sc(NC(=O)c1cc(c(Cl)cc1Cl)S(=O)(=O)N1CCOCC1)c2C#N
: