Target
Alpha-2A adrenergic receptor
Ligand
BDBM81802
Substrate
Ki
3600±n/a nM
Comments
PDSP_505
Citation
 Blaxall, HSMurphy, TJBaker, JCRay, CBylund, DB Characterization of the alpha-2C adrenergic receptor subtype in the opossum kidney and in the OK cell line. J Pharmacol Exp Ther 259:323-9 (1991) Target
Name:
Alpha-2A adrenergic receptor
Synonyms:
ADA2A_HUMAN ADRA2R Adrenergic alpha2A Alpha-2 adrenergic receptor subtype C10 Alpha-2A adrenoreceptor alpha-2A adrenergic receptor [Homo sapiens]
Type:
Enzyme
Mol. Mass.:
48979.91
Organism:
Homo sapiens (Human)
Description:
P08913
Residue:
465
  
Inhibitor
Name:
BDBM81802
Synonyms:
CAS_81382-52-7 CGS10746B | PENTIAPINE MALEATE
Type:
Small organic molecule
Emp. Form.:
C15H17N5S
Mol. Mass.:
299.394
SMILES:
CN1CCN(CC1)C1=Nc2ccccc2Sc2nccn12
: