Target
Beta-2 adrenergic receptor
Ligand
BDBM81882
Substrate
Ki
13.18±n/a nM
Comments
PDSP_6654
Citation
 Tsuchihashi, HNakashima, YKinami, JNagatomo, T Characteristics of 125I-iodocyanopindolol binding to beta-adrenergic and serotonin-1B receptors of rat brain: selectivity of beta-adrenergic agents. Jpn J Pharmacol 52:195-200 (1990)  
Target
Name:
Beta-2 adrenergic receptor
Synonyms:
ADRB2_RAT Adrb2r | Adrenergic receptor beta
Type:
PROTEIN
Mol. Mass.:
46896.26
Organism:
Rattus norvegicus
Description:
ChEMBL_38603
Residue:
418
  
Inhibitor
Name:
BDBM81882
Synonyms:
CAS_93633-92-2 | YM-09538
Type:
Small organic molecule
Emp. Form.:
C18H24N2O5S
Mol. Mass.:
380.459
SMILES:
COc1ccccc1OCCNCC(O)c1ccc(C)c(c1)S(N)(=O)=O
: