Target
Muscarinic acetylcholine receptor M3
Ligand
BDBM81937
Substrate
Ki
6.31±n/a nM
Comments
PDSP_2313
Citation
 Hulme, ECBirdsall, NJBuckley, NJ Muscarinic receptor subtypes. Annu Rev Pharmacol Toxicol 30:633-73 (1990)  
Target
Name:
Muscarinic acetylcholine receptor M3
Synonyms:
ACM3_RAT Chrm-3 | Chrm3
Type:
Enzyme Catalytic Domain
Mol. Mass.:
66086.66
Organism:
RAT
Description:
Cholinergic, muscarinic M3 CHRM3 RAT::P08483
Residue:
589
  
Inhibitor
Name:
BDBM81937
Synonyms:
CAS_9050-30-0 Heparitin, sulfate
Type:
Small organic molecule
Emp. Form.:
C26H42N2O36S5
Mol. Mass.:
1118.928
SMILES:
CC(=O)N[C@H]1CO[C@H](COS(O)(=O)=O)[C@@H](O[C@@H]2O[C@@H]([C@@H](O[C@H]3O[C@H](CO)[C@@H](O[C@@H]4O[C@H]([C@@H](O)[C@H](O)[C@H]4OS(O)(=O)=O)C(O)=O)[C@H](OS(O)(=O)=O)[C@H]3NS(O)(=O)=O)[C@H](O)[C@H]2OS(O)(=O)=O)C(O)=O)[C@@H]1O
: