Target
Voltage-dependent L-type calcium channel subunit alpha-1C
Ligand
BDBM81941
Substrate
Ki
>10000±n/a nM
Comments
PDSP_1099
Citation
 Zobrist, RHMecca, TE [3H]TA-3090, a selective benzothiazepine-type calcium channel receptor antagonist: in vitro characterization. J Pharmacol Exp Ther 253:461-5 (1990) Target
Name:
Voltage-dependent L-type calcium channel subunit alpha-1C
Synonyms:
CAC1C_RAT Cacn2 Cacnl1a1 Calcium channel (Type L) Calcium channel, L type, alpha-1 polypeptide, isoform 1, cardiac muscle RBC Voltage-dependent L-type calcium channel subunit alpha-1C Voltage-gated L-type calcium channel alpha-1C subunit | Voltage-gated calcium channel subunit alpha Cav1.2
Type:
Enzyme Catalytic Domain
Mol. Mass.:
243492.26
Organism:
RAT
Description:
Calcium channel 0 RAT::P22002
Residue:
2169
  
Inhibitor
Name:
BDBM81941
Synonyms:
l-TA-3090
Type:
Emp. Form.:
C22H25ClN2O4S
Mol. Mass.:
448.963
SMILES:
COc1ccc(cc1)[C@H]1Sc2cc(Cl)ccc2N(CCN(C)C)C(=O)[C@H]1OC(C)=O
: