Target
Class E basic helix-loop-helix protein 22
Ligand
BDBM81942
Substrate
Ki
0.5±n/a nM
Comments
PDSP_1774
Citation
 Burcher, EBuck, SHLovenberg, WO'Donohue, TL Characterization and autoradiographic localization of multiple tachykinin binding sites in gastrointestinal tract and bladder. J Pharmacol Exp Ther 236:819-31 (1986) Target
Name:
Class E basic helix-loop-helix protein 22
Synonyms:
BHE Bhlhb5 Class E basic helix-loop-helix protein 22
Type:
Enzyme Catalytic Domain
Mol. Mass.:
35220.68
Organism:
MOUSE
Description:
BHE 0 MOUSE::Q8C6A8
Residue:
355
  
Inhibitor
Name:
BDBM81942
Synonyms:
CAS_55582 NSC_55582 Substance K
Type:
Small organic molecule
Emp. Form.:
C50H80N14O14S
Mol. Mass.:
1133.321
SMILES:
CSCCC(NC(=O)C(CC(C)C)NC(=O)CNC(=O)C(NC(=O)C(Cc1ccccc1)NC(=O)C(CO)NC(=O)C(CC(O)=O)NC(=O)C(NC(=O)C(CCCCN)NC(=O)C(N)Cc1cnc[nH]1)C(C)O)C(C)C)C(N)=O
: