Target
Alpha-1A adrenergic receptor
Ligand
BDBM50019848
Substrate
Ki
2300±n/a nM
Comments
PDSP_959
Citation
 Hieble, JPDeMarinis, RMFowler, PJMatthews, WD Selective alpha-2 adrenoceptor blockade by SK&F 86466: in vitro characterization of receptor selectivity. J Pharmacol Exp Ther 236:90-6 (1986) Target
Name:
Alpha-1A adrenergic receptor
Synonyms:
ADA1A_RABIT ADRA1C | adrenergic Alpha1
Type:
Enzyme Catalytic Domain
Mol. Mass.:
51390.87
Organism:
RABBIT
Description:
adrenergic Alpha1 0 RABBIT::O02824
Residue:
466
  
Inhibitor
Name:
BDBM50019848
Synonyms:
2-(2,3-dihydro-1,4-benzodioxin-2-yl)-4,5-dihydro-1H-imidazole CHEMBL10316 US8633208, Idazoxan
Type:
Small organic molecule
Emp. Form.:
C11H12N2O2
Mol. Mass.:
204.2252
SMILES:
C1CN=C(N1)C1COc2ccccc2O1
: