Target
Alpha-1A adrenergic receptor
Ligand
BDBM66983
Substrate
Ki
900±n/a nM
Comments
PDSP_1727
Citation
 Hieble, JPDeMarinis, RMFowler, PJMatthews, WD Selective alpha-2 adrenoceptor blockade by SK&F 86466: in vitro characterization of receptor selectivity. J Pharmacol Exp Ther 236:90-6 (1986) Target
Name:
Alpha-1A adrenergic receptor
Synonyms:
ADA1A_RABIT ADRA1C | adrenergic Alpha1
Type:
Enzyme Catalytic Domain
Mol. Mass.:
51390.87
Organism:
RABBIT
Description:
adrenergic Alpha1 0 RABBIT::O02824
Residue:
466
  
Inhibitor
Name:
BDBM66983
Synonyms:
6-chloranyl-3-methyl-1,2,4,5-tetrahydro-3-benzazepine;hydrochloride CHEMBL123349 SKF 86466 SMR001254100 | cid_10220250
Type:
Small organic molecule
Emp. Form.:
C11H14ClN
Mol. Mass.:
195.689
SMILES:
CN1CCc2cccc(Cl)c2CC1
: