Target
Alpha-1D adrenergic receptor
Ligand
BDBM50019848
Substrate
Ki
12±n/a nM
Comments
PDSP_959
Citation
 Hieble, JPDeMarinis, RMFowler, PJMatthews, WD Selective alpha-2 adrenoceptor blockade by SK&F 86466: in vitro characterization of receptor selectivity. J Pharmacol Exp Ther 236:90-6 (1986) Target
Name:
Alpha-1D adrenergic receptor
Synonyms:
ADA1D_MOUSE Adra1d Gpcr8 | adrenergic Alpha2
Type:
Enzyme
Mol. Mass.:
59890.14
Organism:
Mus musculus (Mouse)
Description:
P97714
Residue:
562
  
Inhibitor
Name:
BDBM50019848
Synonyms:
2-(2,3-dihydro-1,4-benzodioxin-2-yl)-4,5-dihydro-1H-imidazole CHEMBL10316 US8633208, Idazoxan
Type:
Small organic molecule
Emp. Form.:
C11H12N2O2
Mol. Mass.:
204.2252
SMILES:
C1CN=C(N1)C1COc2ccccc2O1
: