Target
Alpha-2C adrenergic receptor
Ligand
BDBM36024
Substrate
Ki
1253±n/a nM
Comments
PDSP_1482
Citation
 Boyajian, CLLeslie, FM Pharmacological evidence for alpha-2 adrenoceptor heterogeneity: differential binding properties of [3H]rauwolscine and [3H]idazoxan in rat brain. J Pharmacol Exp Ther 241:1092-8 (1987) Target
Name:
Alpha-2C adrenergic receptor
Synonyms:
ADA2C_RAT Adrenergic receptor alpha adrenergic Alpha2 | adrenergic Alpha2C
Type:
Enzyme Catalytic Domain
Mol. Mass.:
49890.50
Organism:
RAT
Description:
adrenergic Alpha2 0 RAT::P22086
Residue:
458
  
Inhibitor
Name:
BDBM36024
Synonyms:
(R)-(-)-phenylephrine Phenylephrine,(-)
Type:
Guest
Emp. Form.:
C9H14NO2
Mol. Mass.:
168.2124
SMILES:
C[NH2+]C[C@H](O)c1cccc(O)c1
: