Target
Thromboxane A2 receptor
Ligand
BDBM50002765
Substrate
Ki
1404±n/a nM
Comments
PDSP_401
Citation
 Hedberg, AHall, SEOgletree, MLHarris, DNLiu, EC Characterization of [5,6-3H]SQ 29,548 as a high affinity radioligand, binding to thromboxane A2/prostaglandin H2-receptors in human platelets. J Pharmacol Exp Ther 245:786-92 (1988) Target
Name:
Thromboxane A2 receptor
Synonyms:
Prostanoid TP receptor TBXA2R Thromboxane Thromboxane Beta
Type:
Enyzme
Mol. Mass.:
37445.28
Organism:
Homo sapiens (Human)
Description:
P21731
Residue:
343
  
Inhibitor
Name:
BDBM50002765
Synonyms:
BM 13177 CHEMBL8273 [4-(2-Benzenesulfonylamino-ethyl)-phenoxy]-acetic acid [4-(2-Benzenesulfonylamino-ethyl)-phenoxy]-acetic acid(sulotroban)
Type:
Small organic molecule
Emp. Form.:
C16H17NO5S
Mol. Mass.:
335.375
SMILES:
OC(=O)COc1ccc(CCNS(=O)(=O)c2ccccc2)cc1
: