Target
Thromboxane A2 receptor
Ligand
BDBM50002805
Substrate
Ki
5.43±n/a nM
Comments
PDSP_402
Citation
 Hedberg, AHall, SEOgletree, MLHarris, DNLiu, EC Characterization of [5,6-3H]SQ 29,548 as a high affinity radioligand, binding to thromboxane A2/prostaglandin H2-receptors in human platelets. J Pharmacol Exp Ther 245:786-92 (1988) Target
Name:
Thromboxane A2 receptor
Synonyms:
Prostanoid TP receptor TBXA2R Thromboxane Thromboxane Beta
Type:
Enyzme
Mol. Mass.:
37445.28
Organism:
Homo sapiens (Human)
Description:
P21731
Residue:
343
  
Inhibitor
Name:
BDBM50002805
Synonyms:
(daltroban){4-[2-(4-Chloro-benzenesulfonylamino)-ethyl]-phenyl}-acetic acid BM-13505 Daltroban | {4-[2-(4-Chloro-benzenesulfonylamino)-ethyl]-phenyl}-acetic acid
Type:
Small organic molecule
Emp. Form.:
C16H16ClNO4S
Mol. Mass.:
353.821
SMILES:
OC(=O)Cc1ccc(CCNS(=O)(=O)c2ccc(Cl)cc2)cc1
: