Target
Sodium-dependent serotonin transporter
Ligand
BDBM50020707
Substrate
Ki
3.3±n/a nM
Comments
PDSP_4207
Citation
 Kovachich, GBAronson, CEBrunswick, DJFrazer, A Quantitative autoradiography of serotonin uptake sites in rat brain using [3H]cyanoimipramine. Brain Res 454:78-88 (1988)  
Target
Name:
Sodium-dependent serotonin transporter
Synonyms:
5-HT Transporter 5HT transporter Anandamid membrane transporter, AMT Monoamine transporters; Norepinephrine & serotonin Slc6a4 Sodium-dependent serotonin transporter (SERT) | imipramine receptor
Type:
Multi-pass membrane protein
Mol. Mass.:
70168.43
Organism:
Rattus norvegicus (rat)
Description:
P31652
Residue:
630
  
Inhibitor
Name:
BDBM50020707
Synonyms:
CHEMBL287064 Norzimelidine cis -[3-(4-Bromo-phenyl)-3-pyridin-3-yl-allyl]-methyl-amine ;C2H4O4 | trans-[3-(4-Bromo-phenyl)-3-pyridin-3-yl-allyl]-methyl-amine;C2H4O4
Type:
Small organic molecule
Emp. Form.:
C15H15BrN2
Mol. Mass.:
303.197
SMILES:
CNC\C=C(\c1ccc(Br)cc1)c1cccnc1
: