Target
D(2) dopamine receptor
Ligand
BDBM50026957
Substrate
Ki
30±n/a nM
Comments
PDSP_268
Citation
 Nicklaus, KJMcGonigle, PMolinoff, PB [3H]SCH 23390 labels both dopamine-1 and 5-hydroxytryptamine1c receptors in the choroid plexus. J Pharmacol Exp Ther 247:343-8 (1988) Target
Name:
D(2) dopamine receptor
Synonyms:
DOPAMINE D1 DRD2 Dopamine D2 receptor
Type:
Enzyme Catalytic Domain
Mol. Mass.:
50587.58
Organism:
CANINE
Description:
DOPAMINE D1 DRD1 CANINE::Q9GJU1
Residue:
443
  
Inhibitor
Name:
BDBM50026957
Synonyms:
(cis) 2-{4-[3-(2-Trifluoromethyl-thioxanthen-9-ylidene)-propyl]-piperazin-1-yl}-ethanol(Flupentixol) 2-(4-{3-[2-Trifluoromethyl-thioxanthen-(9E)-ylidene]-propyl}-piperazin-1-yl)-ethanol FLUPENTHIXOL, Alpha Flupenthixol | Flupenthixol, Beta
Type:
Small organic molecule
Emp. Form.:
C23H25F3N2OS
Mol. Mass.:
434.518
SMILES:
OCCN1CCN(CC\C=C2/c3ccccc3Sc3ccc(cc23)C(F)(F)F)CC1
: