Target
Adenosine receptor A2a
Ligand
BDBM82017
Substrate
Ki
>10000±n/a nM
Comments
PDSP_2816
Citation
 Schwabe, UUkena, DLohse, MJ Xanthine derivatives as antagonists at A1 and A2 adenosine receptors. Naunyn Schmiedebergs Arch Pharmacol 330:212-21 (1985)  
Target
Name:
Adenosine receptor A2a
Synonyms:
A2A adenosine receptor (hA2A) ADENOSINE A2 ADORA2 Adenosine A2A receptor (A2AAR)
Type:
G Protein-Coupled Receptor (GPCR)
Mol. Mass.:
44716.46
Organism:
Homo sapiens (Human)
Description:
P29274
Residue:
412
  
Inhibitor
Name:
BDBM82017
Synonyms:
8-(4-Acetoxyphenyl)theophylline
Type:
Emp. Form.:
C15H14N4O4
Mol. Mass.:
314.2961
SMILES:
CC(=O)Oc1ccc(cc1)-c1nc2n(C)c(=O)n(C)c(=O)c2[nH]1
: