Target
Myosin light chain kinase, smooth muscle
Ligand
BDBM3045
Substrate
Meas. Tech.
cGPK assay
IC50
49±n/a nM
Citation
 Kleinschroth, JHartenstein, JRudolph, CSchachtele, C Novel Indolocarbazole protein kinase C inhibitors with improved biochemical and physicochemical properties. Bioorg Med Chem Lett 5:55-60 (1995)    Article 
Target
Name:
Myosin light chain kinase, smooth muscle
Synonyms:
KRP MLCK MYLK MYLK_HUMAN Telokin | smMLCK
Type:
Protein
Mol. Mass.:
210702.56
Organism:
Homo sapiens (Human)
Description:
Q15746
Residue:
1914
  
Inhibitor
Name:
BDBM3045
Synonyms:
3-{19-methoxy-23-methyl-12,14-dioxo-3,13,23-triazahexacyclo[14.7.0.0^{2,10}.0^{4,9}.0^{11,15}.0^{17,22}]tricosa-1(16),2(10),4(9),5,7,11(15),17,19,21-nonaen-3-yl}propanenitrile Indolocarbazole deriv.
Type:
Small organic molecule
Emp. Form.:
C25H18N4O3
Mol. Mass.:
422.4354
SMILES:
COc1ccc2n(C)c3c(c4C(=O)NC(=O)c4c4c5ccccc5n(CCC#N)c34)c2c1
: