Target
Isoform 1 of Fibronectin (1)
Ligand
BDBM50244430
Substrate
Meas. Tech.
In Vitro Kinase Assay
IC50
9.1±0.0 nM
Citation
 Zhou, TCommodore, LHuang, WSWang, YSawyer, TKShakespeare, WCClackson, TZhu, XDalgarno, DC Structural analysis of DFG-in and DFG-out dual Src-Abl inhibitors sharing a common vinyl purine template. Chem Biol Drug Des 75:18-28 (2010)  
Target
Name:
Isoform 1 of Fibronectin (1)
Synonyms:
FINC_HUMAN FN1 Fibronectin (1) | Tyrosine-protein kinase SRC
Type:
PROTEIN
Mol. Mass.:
262571.78
Organism:
Homo sapiens (Human)
Description:
EBI_17040
Residue:
2386
  
Inhibitor
Name:
BDBM50244430
Synonyms:
9-(2,6-dimethylstyryl)-N-(4-(dimethylphosphoryl)phenyl)-9H-purin-6-amine CHEMBL488840
Type:
Small organic molecule
Emp. Form.:
C23H24N5OP
Mol. Mass.:
417.4433
SMILES:
Cc1cccc(C)c1\C=C\n1cnc2c(Nc3ccc(cc3)P(C)(C)=O)ncnc12
: