Target
Delta-aminolevulinic acid dehydratase
Ligand
BDBM50137044
Substrate
Meas. Tech.
PBGS Assay
pH
8.1±0
Temperature
310.15±0 K
Ki
>1.50000e+8±n/a nM
Citation
 Stauffer, FZizzari, EEngeloch-Jarret, CFaurite, JPBobálová, JNeier, R Inhibition studies of porphobilinogen synthase from Escherichia coli differentiating between the two recognition sites. Chembiochem 2:343-54 (2001)  
Target
Name:
Delta-aminolevulinic acid dehydratase
Synonyms:
HEM2_ECOLI hemB | ncf
Type:
Enzyme
Mol. Mass.:
35617.37
Organism:
Escherichia coli
Description:
P0ACB2
Residue:
324
  
Inhibitor
Name:
BDBM50137044
Synonyms:
Substrate analogue, 16 glycylglycine
Type:
Small organic molecule
Emp. Form.:
C4H8N2O3
Mol. Mass.:
132.1179
SMILES:
[NH3+]CC(=O)NCC([O-])=O
: