Target
D(1A) dopamine receptor
Ligand
BDBM50008735
Substrate
Ki
14.6±n/a nM
Comments
PDSP_449
Citation
 Billard, WRuperto, VCrosby, GIorio, LCBarnett, A Characterization of the binding of 3H-SCH 23390, a selective D-1 receptor antagonist ligand, in rat striatum. Life Sci 35:1885-93 (1984)  
Target
Name:
D(1A) dopamine receptor
Synonyms:
DOPAMINE D1 Dopamine D1 high Dopamine receptor Dopamine1-like Drd1a
Type:
Enzyme Catalytic Domain
Mol. Mass.:
49429.75
Organism:
RAT
Description:
P18901
Residue:
446
  
Inhibitor
Name:
BDBM50008735
Synonyms:
(+)-3-(tert-butyl)-(3S,4aS,13bS)-2,3,4,4a,8,9,13b,14-octahydro-1H-benzo[4,5]cyclohepta[de]pyrido[2,1-a]isoquinolin-3-ol (+/-)-3-(tert-butyl)-(3S,4aS,13bS)-2,3,4,4a,8,9,13b,14-octahydro-1H-benzo[4,5]cyclohepta[de]pyrido[2,1-a]isoquinolin-3-ol 3-(tert-butyl)-(3S,4aS,13bS)-2,3,4,4a,8,9,13b,14-octahydro-1H-benzo[4,5]cyclohepta[de]pyrido[2,1-a]isoquinolin-3-ol 3-(tert-butyl)-(3S,4aS,13bS)-2,3,4,4a,8,9,13b,14-octahydro-1H-benzo[4,5]cyclohepta[de]pyrido[2,1-a]isoquinolin-3-ol((+)-butaclamol) BUTACLAMOL BUTACLAMOL,(+) CHEMBL8514 | d-Butaclamol
Type:
Small organic molecule
Emp. Form.:
C25H31NO
Mol. Mass.:
361.5197
SMILES:
CC(C)(C)[C@]1(O)CCN2C[C@H]3c4ccccc4CCc4cccc([C@@H]2C1)c34
: