Target
D(1A) dopamine receptor
Ligand
BDBM81490
Substrate
Ki
2.9±n/a nM
Comments
PDSP_527
Citation
 Billard, WRuperto, VCrosby, GIorio, LCBarnett, A Characterization of the binding of 3H-SCH 23390, a selective D-1 receptor antagonist ligand, in rat striatum. Life Sci 35:1885-93 (1984)  
Target
Name:
D(1A) dopamine receptor
Synonyms:
DOPAMINE D1 Dopamine D1 high Dopamine receptor Dopamine1-like Drd1a
Type:
Enzyme Catalytic Domain
Mol. Mass.:
49429.75
Organism:
RAT
Description:
P18901
Residue:
446
  
Inhibitor
Name:
BDBM81490
Synonyms:
CAS_60197-32-2 NSC_68714 cis piflutixol-(Z)
Type:
Small organic molecule
Emp. Form.:
C24H25F4NOS
Mol. Mass.:
451.52
SMILES:
OCCC1CCN(CCC=C2c3ccc(F)cc3Sc3ccc(cc23)C(F)(F)F)CC1
: