Target
D(1A) dopamine receptor
Ligand
BDBM50130273
Substrate
Ki
29.9±n/a nM
Comments
PDSP_1456
Citation
 Billard, WRuperto, VCrosby, GIorio, LCBarnett, A Characterization of the binding of 3H-SCH 23390, a selective D-1 receptor antagonist ligand, in rat striatum. Life Sci 35:1885-93 (1984)  
Target
Name:
D(1A) dopamine receptor
Synonyms:
DOPAMINE D1 Dopamine D1 high Dopamine receptor Dopamine1-like Drd1a
Type:
Enzyme Catalytic Domain
Mol. Mass.:
49429.75
Organism:
RAT
Description:
P18901
Residue:
446
  
Inhibitor
Name:
BDBM50130273
Synonyms:
2-(4-[3-(2-chloro-10H-phenothiazin-10-yl)propyl]-1-piperazinyl)ethanol 2-{4-[3-(2-chloro-10H-phenothiazin-10-yl)propyl]piperazin-1-yl}ethanol 4-[3-(2-chlorophenothiazin-10-yl)propyl]-1-piperazineethanol Chlorpiprazine Perfenazine Trilafon | gamma-(4-(beta-hydroxyethyl)piperazin-1-yl)propyl-2-chlorophenothiazine
Type:
Small organic molecule
Emp. Form.:
C21H26ClN3OS
Mol. Mass.:
403.969
SMILES:
OCCN1CCN(CCCN2c3ccccc3Sc3ccc(Cl)cc23)CC1
: