Target
D(1A) dopamine receptor
Ligand
BDBM50015720
Substrate
Ki
>10000±n/a nM
Comments
PDSP_1688
Citation
 Billard, WRuperto, VCrosby, GIorio, LCBarnett, A Characterization of the binding of 3H-SCH 23390, a selective D-1 receptor antagonist ligand, in rat striatum. Life Sci 35:1885-93 (1984)  
Target
Name:
D(1A) dopamine receptor
Synonyms:
DOPAMINE D1 Dopamine D1 high Dopamine receptor Dopamine1-like Drd1a
Type:
Enzyme Catalytic Domain
Mol. Mass.:
49429.75
Organism:
RAT
Description:
P18901
Residue:
446
  
Inhibitor
Name:
BDBM50015720
Synonyms:
(hyoscine)3-Hydroxy-2-phenyl-propionic acid 9-methyl-3-oxa-9-aza-tricyclo[3.3.1.0*2,4*]non-7-yl ester 9-methyl-3-oxa-9-azatricyclo[3.3.1.02,4]non-7-yl 3-hydroxy-2-phenylpropanoate CHEMBL13030 SCOPOLAMINE
Type:
Small organic molecule
Emp. Form.:
C17H21NO4
Mol. Mass.:
303.3529
SMILES:
CN1C2CC(CC1C1OC21)OC(=O)C(CO)c1ccccc1
: