Target
D(2) dopamine receptor
Ligand
BDBM50000766
Substrate
Ki
>10000±n/a nM
Comments
PDSP_656
Citation
 Billard, WRuperto, VCrosby, GIorio, LCBarnett, A Characterization of the binding of 3H-SCH 23390, a selective D-1 receptor antagonist ligand, in rat striatum. Life Sci 35:1885-93 (1984)  
Target
Name:
D(2) dopamine receptor
Synonyms:
DOPAMINE D2 DOPAMINE D2 Short Dopamine D2 receptor Drd2
Type:
G Protein-Coupled Receptor (GPCR)
Mol. Mass.:
50931.60
Organism:
Rattus norvegicus (rat)
Description:
P61169
Residue:
444
  
Inhibitor
Name:
BDBM50000766
Synonyms:
CHEMBL12 US9271961, Diazepam
Type:
Small organic molecule
Emp. Form.:
C16H13ClN2O
Mol. Mass.:
284.74
SMILES:
CN1c2ccc(Cl)cc2C(=NCC1=O)c1ccccc1
: