Target
D(2) dopamine receptor
Ligand
BDBM24183
Substrate
Ki
>10000±n/a nM
Comments
PDSP_867
Citation
 Billard, WRuperto, VCrosby, GIorio, LCBarnett, A Characterization of the binding of 3H-SCH 23390, a selective D-1 receptor antagonist ligand, in rat striatum. Life Sci 35:1885-93 (1984)  
Target
Name:
D(2) dopamine receptor
Synonyms:
DOPAMINE D2 DOPAMINE D2 Short Dopamine D2 receptor Drd2
Type:
G Protein-Coupled Receptor (GPCR)
Mol. Mass.:
50931.60
Organism:
Rattus norvegicus (rat)
Description:
P61169
Residue:
444
  
Inhibitor
Name:
BDBM24183
Synonyms:
4-amino-n-[2,3-3H]butyric acid Aminalon GABA [3H]GABA | cid_119
Type:
Radiolabeled ligand
Emp. Form.:
C4H9NO2
Mol. Mass.:
103.1198
SMILES:
NCCCC(O)=O
: