Target
D(2) dopamine receptor
Ligand
BDBM82246
Substrate
Ki
73±n/a nM
Comments
PDSP_1898
Citation
 Billard, WRuperto, VCrosby, GIorio, LCBarnett, A Characterization of the binding of 3H-SCH 23390, a selective D-1 receptor antagonist ligand, in rat striatum. Life Sci 35:1885-93 (1984)  
Target
Name:
D(2) dopamine receptor
Synonyms:
DOPAMINE D2 DOPAMINE D2 Short Dopamine D2 receptor Drd2
Type:
G Protein-Coupled Receptor (GPCR)
Mol. Mass.:
50931.60
Organism:
Rattus norvegicus (rat)
Description:
P61169
Residue:
444
  
Inhibitor
Name:
BDBM82246
Synonyms:
trans piflutixol-(E)
Type:
Small organic molecule
Emp. Form.:
C24H25F4NOS
Mol. Mass.:
451.52
SMILES:
OCCC1CCN(CC\C=C2/c3ccc(F)cc3Sc3ccc(cc23)C(F)(F)F)CC1
: