Target
D(2) dopamine receptor
Ligand
BDBM50026957
Substrate
Ki
65±n/a nM
Comments
PDSP_358
Citation
 Zahniser, NRDubocovich, ML Comparison of dopamine receptor sites labeled by [3H]-S-sulpiride and [3H]-spiperone in striatum. J Pharmacol Exp Ther 227:592-9 (1983) Target
Name:
D(2) dopamine receptor
Synonyms:
DOPAMINE D2 DOPAMINE D2 Short Dopamine D2 receptor Drd2
Type:
G Protein-Coupled Receptor (GPCR)
Mol. Mass.:
50931.60
Organism:
Rattus norvegicus (rat)
Description:
P61169
Residue:
444
  
Inhibitor
Name:
BDBM50026957
Synonyms:
(cis) 2-{4-[3-(2-Trifluoromethyl-thioxanthen-9-ylidene)-propyl]-piperazin-1-yl}-ethanol(Flupentixol) 2-(4-{3-[2-Trifluoromethyl-thioxanthen-(9E)-ylidene]-propyl}-piperazin-1-yl)-ethanol FLUPENTHIXOL, Alpha Flupenthixol | Flupenthixol, Beta
Type:
Small organic molecule
Emp. Form.:
C23H25F3N2OS
Mol. Mass.:
434.518
SMILES:
OCCN1CCN(CC\C=C2/c3ccccc3Sc3ccc(cc23)C(F)(F)F)CC1
: