Target
Metabotropic glutamate receptor 2
Ligand
BDBM82250
Substrate
Ki
>10000±n/a nM
Comments
PDSP_4812
Citation
 Thomsen, CBoel, ESuzdak, PD Actions of phenylglycine analogs at subtypes of the metabotropic glutamate receptor family. Eur J Pharmacol 267:77-84 (1994)  
Target
Name:
Metabotropic glutamate receptor 2
Synonyms:
GPRC1B GRM2_HUMAN Metabotropic glutamate receptor mGlu2 | metabotropic glutamate 2
Type:
Enzyme
Mol. Mass.:
95584.88
Organism:
Homo sapiens (Human)
Description:
Q14416
Residue:
872
  
Inhibitor
Name:
BDBM82250
Synonyms:
(R)-3-Carboxy-4-hydroxyphenylglycine CB7394016
Type:
Small organic molecule
Emp. Form.:
C9H9NO5
Mol. Mass.:
211.1715
SMILES:
N[C@@H](C(O)=O)c1ccc(O)c(c1)C(O)=O
: