Target
Muscarinic acetylcholine receptor M3
Ligand
BDBM50240680
Substrate
Ki
1.86±n/a nM
Comments
PDSP_3895
Citation
 Lazareno, SBuckley, NJRoberts, FF Characterization of muscarinic M4 binding sites in rabbit lung, chicken heart, and NG108-15 cells. Mol Pharmacol 38:805-15 (1990) Target
Name:
Muscarinic acetylcholine receptor M3
Synonyms:
ACM3_RAT Chrm-3 | Chrm3
Type:
Enzyme Catalytic Domain
Mol. Mass.:
66086.66
Organism:
RAT
Description:
Cholinergic, muscarinic M3 CHRM3 RAT::P08483
Residue:
589
  
Inhibitor
Name:
BDBM50240680
Synonyms:
1-(bicyclo[2.2.1]hept-5-en-2-yl)-1-phenyl-3-(piperidin-1-yl)propan-1-ol CHEMBL1101 alpha-bicyclo[2.2.1]hept-5-en-2-yl-alpha-phenyl-1-piperidinepropanol
Type:
Small organic molecule
Emp. Form.:
C21H29NO
Mol. Mass.:
311.4611
SMILES:
OC(CCN1CCCCC1)(C1CC2CC1C=C2)c1ccccc1
: