Target
Muscarinic acetylcholine receptor M4
Ligand
BDBM82374
Substrate
Ki
4.27±n/a nM
Comments
PDSP_3896
Citation
 Lazareno, SBuckley, NJRoberts, FF Characterization of muscarinic M4 binding sites in rabbit lung, chicken heart, and NG108-15 cells. Mol Pharmacol 38:805-15 (1990) Target
Name:
Muscarinic acetylcholine receptor M4
Synonyms:
ACM4_CHICK Cholinergic, muscarinic M4
Type:
Enzyme Catalytic Domain
Mol. Mass.:
54968.10
Organism:
Chick
Description:
Cholinergic, muscarinic M4 CHRM4 Chick::P17200
Residue:
490
  
Inhibitor
Name:
BDBM82374
Synonyms:
Botiacrine NSC_71202
Type:
Small organic molecule
Emp. Form.:
C20H24N2OS
Mol. Mass.:
340.482
SMILES:
CN(C)CCSC(=O)N1c2ccccc2C(C)(C)c2ccccc12
: