Target
Muscarinic acetylcholine receptor M4
Ligand
BDBM39341
Substrate
Ki
25.12±n/a nM
Comments
PDSP_1503
Citation
 Lazareno, SBuckley, NJRoberts, FF Characterization of muscarinic M4 binding sites in rabbit lung, chicken heart, and NG108-15 cells. Mol Pharmacol 38:805-15 (1990) Target
Name:
Muscarinic acetylcholine receptor M4
Synonyms:
ACM4_CHICK Cholinergic, muscarinic M4
Type:
Enzyme Catalytic Domain
Mol. Mass.:
54968.10
Organism:
Chick
Description:
Cholinergic, muscarinic M4 CHRM4 Chick::P17200
Residue:
490
  
Inhibitor
Name:
BDBM39341
Synonyms:
11-[(4-methylpiperazin-1-yl)acetyl]-5,11-dihydro-6H-pyrido[2,3-b][1,4]benzodiazepin-6-one 11-[2-(4-methylpiperazin-1-yl)acetyl]-5H-pyrido[2,3-b][1,4]benzodiazepin-6-one;hydrochloride 11-[2-(4-methylpiperazino)acetyl]-5H-pyrido[2,3-b][1,4]benzodiazepin-6-one;hydrochloride MLS000069702 PIRENZEPINE DIHYDROCHLORIDE cid_185248
Type:
Small organic molecule
Emp. Form.:
C19H21N5O2
Mol. Mass.:
351.4023
SMILES:
CN1CCN(CC(=O)N2c3ccccc3C(=O)Nc3cccnc23)CC1
: