Target
Alpha-1A adrenergic receptor
Ligand
BDBM82424
Substrate
Ki
501.18±n/a nM
Comments
PDSP_1319
Citation
 Schwinn, DAJohnston, GIPage, SOMosley, MJWilson, KHWorman, NPCampbell, SFidock, MDFurness, LMParry-Smith, DJ Cloning and pharmacological characterization of human alpha-1 adrenergic receptors: sequence corrections and direct comparison with other species homologues. J Pharmacol Exp Ther 272:134-42 (1995) Target
Name:
Alpha-1A adrenergic receptor
Synonyms:
ADA1A_HUMAN ADRA1C Alpha 1A-adrenoceptor Alpha adrenergic receptor 1a Alpha-adrenergic receptor 1c adrenergic Alpha1 | adrenergic Alpha1C
Type:
Cell-surface receptors
Mol. Mass.:
51511.67
Organism:
Homo sapiens (Human)
Description:
P35348
Residue:
466
  
Inhibitor
Name:
BDBM82424
Synonyms:
CAS_1236 Niguldipine(+)
Type:
Small organic molecule
Emp. Form.:
C36H39N3O6
Mol. Mass.:
609.7114
SMILES:
COC(=O)C1C(C(C(=O)OCCCN2CCC(CC2)(c2ccccc2)c2ccccc2)=C(C)N=C1C)c1cccc(c1)[N+]([O-])=O
: