Target
5-hydroxytryptamine receptor 2C
Ligand
BDBM50028066
Substrate
Ki
4800±n/a nM
Comments
PDSP_639
Citation
 Cusack, BNelson, ARichelson, E Binding of antidepressants to human brain receptors: focus on newer generation compounds. Psychopharmacology (Berl) 114:559-65 (1994)  
Target
Name:
5-hydroxytryptamine receptor 2C
Synonyms:
5-HT-1C 5-HT1C 5-HT2C-INI 5-HTR2C 5-hydroxytryptamine receptor 2C (5-HT-2C) 5HT-1C HTR1C Serotonin (5-HT3) receptor Serotonin Receptor 2C
Type:
G Protein-Coupled Receptor (GPCR)
Mol. Mass.:
51836.79
Organism:
Homo sapiens (Human)
Description:
P28335
Residue:
458
  
Inhibitor
Name:
BDBM50028066
Synonyms:
4-(3,4-Dichloro-phenyl)-1,2,3,4-tetrahydro-naphthalen-1-ylamine, HCl Desmethylsertraline
Type:
Small organic molecule
Emp. Form.:
C16H15Cl2N
Mol. Mass.:
292.203
SMILES:
N[C@H]1CC[C@@H](c2ccc(Cl)c(Cl)c2)c2ccccc12
: